Reaction Details
TargetMu-type opioid receptor
LigandBDBM50025266
Substrate/Competitorn/a
Meas. Tech.ChEMBL_1431190 (CHEMBL3385053)
Ki>10000±n/a nM
Citation Polepally, PRHuben, KVardy, ESetola, VMosier, PDRoth, BLZjawiony, JK Michael acceptor approach to the design of new salvinorin A-based high affinity ligands for the kappa-opioid receptor. Eur J Med Chem85:818-29 (2014) 
 
Mu-type opioid receptor
Name:Mu-type opioid receptor
Type:G Protein-Coupled Receptor (GPCR)
Mol. Mass.:44789.51
Organism:Homo sapiens (Human)
Description:P35372
Residue:400
BDBM50025266
NameBDBM50025266
Synonyms:CHEMBL3330672
TypeSmall organic molecule
Emp. Form.C31H34O9
Mol. Mass.550.5963
SMILES[H][C@@]12CC[C@@]3(C)[C@@H](C[C@H](OC(=O)\C=C\c4ccc(OC)cc4)C(=O)[C@]3([H])[C@@]1(C)C[C@H](OC2=O)c1ccoc1)C(=O)OC