Reaction Details
TargetLipoxygenase
LigandBDBM32020
Substrate/Competitorn/a
Meas. Tech.ChEMBL_1437404 (CHEMBL3386626)
IC50 28000±n/a nM
Citation Pavic, KPerkovic, ICindric, MPranjic, MMartin-Kleiner, IKralj, MSchols, DHadjipavlou-Litina, DKatsori, AMZorc, B Novel semicarbazides and ureas of primaquine with bulky aryl or hydroxyalkyl substituents: synthesis, cytostatic and antioxidative activity. Eur J Med Chem86:502-14 (2014) 
 
Lipoxygenase
Name:Lipoxygenase
Synonyms:n/a
Type:PROTEIN
Mol. Mass.:1886.07
Organism:Glycine max
Description:ChEMBL_103841
Residue:18
PNSEEGLTCRGIPNSISI
BDBM32020
NameBDBM32020
TypeSmall organic molecule
Emp. Form.C18H22O4
Mol. Mass.302.3649
SMILESCC(Cc1ccc(O)c(O)c1)C(C)Cc1ccc(O)c(O)c1