Reaction Details
TargetRetinol-binding protein 4
LigandBDBM50026248
Substrate/Competitorn/a
Meas. Tech.ChEMBL_1441245 (CHEMBL3380010)
IC50 3.9±n/a nM
Citation Cioffi, CLDobri, NFreeman, EEConlon, MPChen, PStafford, DGSchwarz, DMGolden, KCZhu, LKitchen, DBBarnes, KDRacz, BQin, QMichelotti, ECywin, CLMartin, WHPearson, PGJohnson, GPetrukhin, K Design, synthesis, and evaluation of nonretinoid retinol binding protein 4 antagonists for the potential treatment of atrophic age-related macular degeneration and Stargardt disease. J Med Chem57:7731-57 (2014) 
 
Retinol-binding protein 4
Name:Retinol-binding protein 4
Type:Protein
Mol. Mass.:23008.75
Organism:Homo sapiens (Human)
Description:P02753
Residue:201
BDBM50026248
NameBDBM50026248
Synonyms:CHEMBL3358465
TypeSmall organic molecule
Emp. Form.C26H24F3N3O4S
Mol. Mass.531.547
SMILESFC(F)(F)c1ccccc1C1CCN(CC1)C(=O)Nc1ccccc1C(=O)NS(=O)(=O)c1ccccc1