Reaction Details
TargetRetinol-binding protein 4
LigandBDBM50026250
Substrate/Competitorn/a
Meas. Tech.ChEMBL_1441245 (CHEMBL3380010)
IC50 2.7±n/a nM
Citation Cioffi, CLDobri, NFreeman, EEConlon, MPChen, PStafford, DGSchwarz, DMGolden, KCZhu, LKitchen, DBBarnes, KDRacz, BQin, QMichelotti, ECywin, CLMartin, WHPearson, PGJohnson, GPetrukhin, K Design, synthesis, and evaluation of nonretinoid retinol binding protein 4 antagonists for the potential treatment of atrophic age-related macular degeneration and Stargardt disease. J Med Chem57:7731-57 (2014) 
 
Retinol-binding protein 4
Name:Retinol-binding protein 4
Type:Protein
Mol. Mass.:23008.75
Organism:Homo sapiens (Human)
Description:P02753
Residue:201
BDBM50026250
NameBDBM50026250
Synonyms:CHEMBL3358470
TypeSmall organic molecule
Emp. Form.C18H17F3N2O4
Mol. Mass.382.3338
SMILESCN(CCOc1ccccc1C(F)(F)F)C(=O)Nc1ccccc1C(O)=O