Reaction Details
TargetRetinol-binding protein 4
LigandBDBM50026254
Substrate/Competitorn/a
Meas. Tech.ChEMBL_1441245 (CHEMBL3380010)
IC50 0.481000±n/a nM
Citation Cioffi, CLDobri, NFreeman, EEConlon, MPChen, PStafford, DGSchwarz, DMGolden, KCZhu, LKitchen, DBBarnes, KDRacz, BQin, QMichelotti, ECywin, CLMartin, WHPearson, PGJohnson, GPetrukhin, K Design, synthesis, and evaluation of nonretinoid retinol binding protein 4 antagonists for the potential treatment of atrophic age-related macular degeneration and Stargardt disease. J Med Chem57:7731-57 (2014) 
 
Retinol-binding protein 4
Name:Retinol-binding protein 4
Type:Protein
Mol. Mass.:23008.75
Organism:Homo sapiens (Human)
Description:P02753
Residue:201
BDBM50026254
NameBDBM50026254
Synonyms:CHEMBL3359015
TypeSmall organic molecule
Emp. Form.C22H19F3N2O3
Mol. Mass.416.3931
SMILES[H][C@@]12CN(C[C@]1([H])C=C(C2)c1ccccc1C(F)(F)F)C(=O)Nc1ccccc1C(O)=O