Reaction Details
Target1-deoxy-D-xylulose-5-phosphate synthase
LigandBDBM92962
Substrate/Competitorn/a
Meas. Tech.ChEMBL_1441273 (CHEMBL3380663)
Kd 3100±n/a nM
Citation Masini, THirsch, AK Development of inhibitors of the 2C-methyl-D-erythritol 4-phosphate (MEP) pathway enzymes as potential anti-infective agents. J Med Chem57:9740-63 (2014) 
 
1-deoxy-D-xylulose-5-phosphate synthase
Name:1-deoxy-D-xylulose-5-phosphate synthase
Type:PROTEIN
Mol. Mass.:67882.02
Organism:Mycobacterium tuberculosis
Description:ChEMBL_1441273
Residue:638
BDBM92962
NameBDBM92962
Synonyms:ThDP
TypeSmall molecule
Emp. Form.C12H19N4O7P2S
Mol. Mass.425.314
SMILESCc1c(CCOP(O)(=O)OP(O)(O)=O)sc[n+]1Cc1cnc(C)nc1N