Reaction Details
Target1-deoxy-D-xylulose 5-phosphate reductoisomerase
LigandBDBM50153713
Substrate/Competitorn/a
Meas. Tech.ChEMBL_1441278 (CHEMBL3380668)
IC50 32±n/a nM
Citation Masini, THirsch, AK Development of inhibitors of the 2C-methyl-D-erythritol 4-phosphate (MEP) pathway enzymes as potential anti-infective agents. J Med Chem57:9740-63 (2014) 
 
1-deoxy-D-xylulose 5-phosphate reductoisomerase
Name:1-deoxy-D-xylulose 5-phosphate reductoisomerase
Type:Protein
Mol. Mass.:43384.52
Organism:Escherichia coli
Description:P45568
Residue:398
BDBM50153713
NameBDBM50153713
Synonyms:3-(N-hydroxyformamido)propylphosphonic acid CHEMBL203125 fosmidomycin
TypeSmall organic molecule
Emp. Form.C4H10NO5P
Mol. Mass.183.0997
SMILESON(CCCP(O)(O)=O)C=O