Reaction Details
TargetDual specificity tyrosine-phosphorylation-regulated kinase 1B
LigandBDBM50026620
Substrate/Competitorn/a
Meas. Tech.ChEMBL_1435350 (CHEMBL3382858)
IC50 100±n/a nM
Citation Schmitt, CMiralinaghi, PMariano, MHartmann, RWEngel, M Hydroxybenzothiophene Ketones Are Efficient Pre-mRNA Splicing Modulators Due to Dual Inhibition of Dyrk1A and Clk1/4. ACS Med Chem Lett5:963-7 (2014) 
 
Dual specificity tyrosine-phosphorylation-regulated kinase 1B
Name:Dual specificity tyrosine-phosphorylation-regulated kinase 1B
Type:Enzyme
Mol. Mass.:69222.24
Organism:Homo sapiens (Human)
Description:Q9Y463
Residue:629
BDBM50026620
NameBDBM50026620
Synonyms:CHEMBL3335363
TypeSmall organic molecule
Emp. Form.C10H8O2S
Mol. Mass.192.234
SMILESCC(=O)c1cc2cc(O)ccc2s1