Reaction Details
TargetHistone deacetylase 1
LigandBDBM50026643
Substrate/Competitorn/a
Meas. Tech.ChEMBL_1435381 (CHEMBL3383455)
IC50 800±n/a nM
Citation Giacomini, ENebbioso, ACiotta, AIanni, CFalchi, FRoberti, MTolomeo, MGrimaudo, SCristina, ADPipitone, RMAltucci, LRecanatini, M Novel antiproliferative chimeric compounds with marked histone deacetylase inhibitory activity. ACS Med Chem Lett5:973-8 (2014) 
 
Histone deacetylase 1
Name:Histone deacetylase 1
Type:Enzyme
Mol. Mass.:55090.27
Organism:Homo sapiens (Human)
Description:Q13547
Residue:482
BDBM50026643
NameBDBM50026643
Synonyms:CHEMBL3335369
TypeSmall organic molecule
Emp. Form.C25H32N2O6
Mol. Mass.456.5314
SMILESCOc1cc(OC)cc(\C=C\c2ccc(OC)c(NC(=O)CCCCCCC(=O)NO)c2)c1