Reaction Details
TargetEnoyl-[acyl-carrier-protein] reductase [NADH]
LigandBDBM8726
Substrate/Competitorn/a
Meas. Tech.ChEMBL_1436802 (CHEMBL3386587)
IC50 630±n/a nM
Citation Naik, MGhorpade, SJena, LKGorai, GNarayan, AGuptha, SSharma, SDinesh, NKaur, PNandishaiah, RBhat, JBalakrishnan, GHumnabadkar, VRamachandran, VNaviri, LKKhadtare, PPanda, MIyer, PSChatterji, M 2-Phenylindole and Arylsulphonamide: Novel Scaffolds Bactericidal against Mycobacterium tuberculosis. ACS Med Chem Lett5:1005-9 (2014) 
 
Enoyl-[acyl-carrier-protein] reductase [NADH]
Name:Enoyl-[acyl-carrier-protein] reductase [NADH]
Type:Enzyme
Mol. Mass.:28526.00
Organism:Mycobacterium tuberculosis (strain ATCC 25618 / H37Rv)
Description:P9WGR1
Residue:269
BDBM8726
NameBDBM8726
Synonyms:5-chloro-2-(2,4-dichlorophenoxy)phenol TCL US20230414581, Compound 35
TypeSmall organic molecule
Emp. Form.C12H7Cl3O2
Mol. Mass.289.542
SMILESOc1cc(Cl)ccc1Oc1ccc(Cl)cc1Cl