Reaction Details
TargetAdenosine receptor A2a
LigandBDBM50026816
Substrate/Competitorn/a
Meas. Tech.ChEMBL_1438219 (CHEMBL3390251)
Ki 23±n/a nM
Citation Moss, SMJayasekara, PSPaoletta, SGao, ZGJacobson, KA Structure-Based Design of Reactive Nucleosides for Site-Specific Modification of the A2A Adenosine Receptor. ACS Med Chem Lett5:1043-8 (2014) 
 
Adenosine receptor A2a
Name:Adenosine receptor A2a
Type:G Protein-Coupled Receptor (GPCR)
Mol. Mass.:44716.46
Organism:Homo sapiens (Human)
Description:P29274
Residue:412
BDBM50026816
NameBDBM50026816
Synonyms:CHEMBL3335523
TypeSmall organic molecule
Emp. Form.C31H35N9O9
Mol. Mass.677.6645
SMILESCCNC(=O)[C@H]1O[C@H]([C@H](O)[C@@H]1O)n1cnc2c(N)nc(NCCc3ccc(CCC(=O)Nc4ccc(OC(C)=O)c(c4)[N+]([O-])=O)cc3)nc12