Reaction Details
TargetAdenosine receptor A2a
LigandBDBM50026818
Substrate/Competitorn/a
Meas. Tech.ChEMBL_1438219 (CHEMBL3390251)
Ki 4360±n/a nM
Citation Moss, SMJayasekara, PSPaoletta, SGao, ZGJacobson, KA Structure-Based Design of Reactive Nucleosides for Site-Specific Modification of the A2A Adenosine Receptor. ACS Med Chem Lett5:1043-8 (2014) 
 
Adenosine receptor A2a
Name:Adenosine receptor A2a
Type:G Protein-Coupled Receptor (GPCR)
Mol. Mass.:44716.46
Organism:Homo sapiens (Human)
Description:P29274
Residue:412
BDBM50026818
NameBDBM50026818
Synonyms:CHEMBL3335524
TypeSmall organic molecule
Emp. Form.C34H40N12O9
Mol. Mass.760.7564
SMILESCCNC(=O)[C@H]1O[C@H]([C@H](O)[C@@H]1O)n1cnc2c(N)nc(NCCc3ccc(CCC(=O)Nc4ccc(OC(=O)CCCCN=[N+]=[N-])c(c4)[N+]([O-])=O)cc3)nc12