Reaction Details
TargetHistone deacetylase 3
LigandBDBM50027494
Substrate/Competitorn/a
Meas. Tech.ChEMBL_1443002 (CHEMBL3379480)
IC50 1.000000±n/a nM
Citation Giannini, GVesci, LBattistuzzi, GVignola, DMilazzo, FMGuglielmi, MBBarbarino, MSantaniello, MFantò, NMor, MRivara, SPala, DTaddei, MPisano, CCabri, W ST7612AA1, a thioacetate-¿(¿-lactam carboxamide) derivative selected from a novel generation of oral HDAC inhibitors. J Med Chem57:8358-77 (2014) 
 
Histone deacetylase 3
Name:Histone deacetylase 3
Type:Enzyme
Mol. Mass.:48829.55
Organism:Homo sapiens (Human)
Description:O15379
Residue:428
BDBM50027494
NameBDBM50027494
Synonyms:CHEMBL3356916
TypeSmall organic molecule
Emp. Form.C20H29N3O3S
Mol. Mass.391.528
SMILESCc1cccc(NC(=O)[C@H](CCCCCS)NC(=O)[C@@H]2CCCC(=O)N2)c1