Reaction Details
TargetHistone deacetylase 3
LigandBDBM50027521
Substrate/Competitorn/a
Meas. Tech.ChEMBL_1443002 (CHEMBL3379480)
IC50 2.0±n/a nM
Citation Giannini, GVesci, LBattistuzzi, GVignola, DMilazzo, FMGuglielmi, MBBarbarino, MSantaniello, MFantò, NMor, MRivara, SPala, DTaddei, MPisano, CCabri, W ST7612AA1, a thioacetate-¿(¿-lactam carboxamide) derivative selected from a novel generation of oral HDAC inhibitors. J Med Chem57:8358-77 (2014) 
 
Histone deacetylase 3
Name:Histone deacetylase 3
Type:Enzyme
Mol. Mass.:48829.55
Organism:Homo sapiens (Human)
Description:O15379
Residue:428
BDBM50027521
NameBDBM50027521
Synonyms:CHEMBL3356925
TypeSmall organic molecule
Emp. Form.C24H29N3O3S
Mol. Mass.439.57
SMILESSCCCCC[C@H](NC(=O)[C@H]1[C@@H](CNC1=O)c1ccccc1)C(=O)Nc1ccccc1