Reaction Details
TargetHistone deacetylase 6
LigandBDBM50027587
Substrate/Competitorn/a
Meas. Tech.ChEMBL_1443003 (CHEMBL3379481)
IC50 4.0±n/a nM
Citation Giannini, GVesci, LBattistuzzi, GVignola, DMilazzo, FMGuglielmi, MBBarbarino, MSantaniello, MFantò, NMor, MRivara, SPala, DTaddei, MPisano, CCabri, W ST7612AA1, a thioacetate-¿(¿-lactam carboxamide) derivative selected from a novel generation of oral HDAC inhibitors. J Med Chem57:8358-77 (2014) 
 
Histone deacetylase 6
Name:Histone deacetylase 6
Type:Chromatin regulator; hydrolase; repressor
Mol. Mass.:131381.51
Organism:Homo sapiens (Human)
Description:Q9UBN7
Residue:1215
BDBM50027587
NameBDBM50027587
Synonyms:CHEMBL3356927
TypeSmall organic molecule
Emp. Form.C24H29N3O3S
Mol. Mass.439.57
SMILESSCCCCC[C@H](NC(=O)[C@H]1[C@H](CNC1=O)c1ccccc1)C(=O)Nc1ccccc1