Reaction Details
TargetPolyamine deacetylase HDAC10
LigandBDBM50027649
Substrate/Competitorn/a
Meas. Tech.ChEMBL_1443005 (CHEMBL3379483)
IC50 9.0±n/a nM
Citation Giannini, GVesci, LBattistuzzi, GVignola, DMilazzo, FMGuglielmi, MBBarbarino, MSantaniello, MFantò, NMor, MRivara, SPala, DTaddei, MPisano, CCabri, W ST7612AA1, a thioacetate-¿(¿-lactam carboxamide) derivative selected from a novel generation of oral HDAC inhibitors. J Med Chem57:8358-77 (2014) 
 
Polyamine deacetylase HDAC10
Name:Polyamine deacetylase HDAC10
Type:Chromatin regulator; hydrolase; repressor
Mol. Mass.:71431.89
Organism:Homo sapiens (Human)
Description:Q969S8
Residue:669
BDBM50027649
NameBDBM50027649
Synonyms:CHEMBL3356527
TypeSmall organic molecule
Emp. Form.C19H27N3O3S
Mol. Mass.377.501
SMILESSCCCCC[C@H](NC(=O)[C@@H]1CCCNC1=O)C(=O)Nc1ccccc1