Reaction Details
TargetHistone deacetylase 11
LigandBDBM50027633
Substrate/Competitorn/a
Meas. Tech.ChEMBL_1443006 (CHEMBL3379484)
IC50 10.0±n/a nM
Citation Giannini, GVesci, LBattistuzzi, GVignola, DMilazzo, FMGuglielmi, MBBarbarino, MSantaniello, MFantò, NMor, MRivara, SPala, DTaddei, MPisano, CCabri, W ST7612AA1, a thioacetate-¿(¿-lactam carboxamide) derivative selected from a novel generation of oral HDAC inhibitors. J Med Chem57:8358-77 (2014) 
 
Histone deacetylase 11
Name:Histone deacetylase 11
Type:Chromatin regulator; hydrolase; repressor
Mol. Mass.:39187.66
Organism:Homo sapiens (Human)
Description:Q96DB2
Residue:347
BDBM50027633
NameBDBM50027633
Synonyms:CHEMBL3356524
TypeSmall organic molecule
Emp. Form.C19H27N3O3S
Mol. Mass.377.501
SMILESSCCCCC[C@H](NC(=O)[C@H]1CCCC(=O)N1)C(=O)Nc1ccccc1