Reaction Details
TargetHistone deacetylase 11
LigandBDBM50027495
Substrate/Competitorn/a
Meas. Tech.ChEMBL_1443006 (CHEMBL3379484)
IC50 3.0±n/a nM
Citation Giannini, GVesci, LBattistuzzi, GVignola, DMilazzo, FMGuglielmi, MBBarbarino, MSantaniello, MFantò, NMor, MRivara, SPala, DTaddei, MPisano, CCabri, W ST7612AA1, a thioacetate-¿(¿-lactam carboxamide) derivative selected from a novel generation of oral HDAC inhibitors. J Med Chem57:8358-77 (2014) 
 
Histone deacetylase 11
Name:Histone deacetylase 11
Type:Chromatin regulator; hydrolase; repressor
Mol. Mass.:39187.66
Organism:Homo sapiens (Human)
Description:Q96DB2
Residue:347
BDBM50027495
NameBDBM50027495
Synonyms:CHEMBL3356917
TypeSmall organic molecule
Emp. Form.C20H29N3O3S
Mol. Mass.391.528
SMILESCc1ccc(NC(=O)[C@H](CCCCCS)NC(=O)[C@@H]2CCCC(=O)N2)cc1