Reaction Details
TargetProton-coupled folate transporter
LigandBDBM18050
Substrate/Competitorn/a
Meas. Tech.ChEMBL_1431349 (CHEMBL3387475)
IC50 121±n/a nM
Citation Golani, LKGeorge, CZhao, SRaghavan, SOrr, SWallace, AWilson, MRHou, ZMatherly, LHGangjee, A Structure-activity profiles of novel 6-substituted pyrrolo[2,3-d]pyrimidine thienoyl antifolates with modified amino acids for cellular uptake by folate receptorsa andß and the proton-coupled folate transporter. J Med Chem57:8152-66 (2014) 
 
Proton-coupled folate transporter
Name:Proton-coupled folate transporter
Type:PROTEIN
Mol. Mass.:49782.13
Organism:Homo sapiens (Human)
Description:ChEMBL_1469597
Residue:459
BDBM18050
NameBDBM18050
Synonyms:2-[(4-{[(2,4-diaminopteridin-6-yl)methyl](methyl)amino}phenyl)formamido]pentanedioic acid MTX cid_126941
TypeSmall organic molecule
Emp. Form.C20H22N8O5
Mol. Mass.454.4393
SMILESCN(Cc1cnc2nc(N)nc(N)c2n1)c1ccc(cc1)C(=O)N[C@@H](CCC(O)=O)C(O)=O