Reaction Details
TargetFolate receptor beta
LigandBDBM50027655
Substrate/Competitorn/a
Meas. Tech.ChEMBL_1431348 (CHEMBL3387474)
IC50 746±n/a nM
Citation Golani, LKGeorge, CZhao, SRaghavan, SOrr, SWallace, AWilson, MRHou, ZMatherly, LHGangjee, A Structure-activity profiles of novel 6-substituted pyrrolo[2,3-d]pyrimidine thienoyl antifolates with modified amino acids for cellular uptake by folate receptorsa andß and the proton-coupled folate transporter. J Med Chem57:8152-66 (2014) 
 
Folate receptor beta
Name:Folate receptor beta
Type:PROTEIN
Mol. Mass.:29286.32
Organism:Homo sapiens (Human)
Description:ChEMBL_20077
Residue:255
BDBM50027655
NameBDBM50027655
Synonyms:CHEBI:5847 Tomudex ZD-16 | ZD-1694
TypeSmall organic molecule
Emp. Form.C21H22N4O6S
Mol. Mass.458.488
SMILESCN(Cc1ccc2[nH]c(C)nc(=O)c2c1)c1ccc(s1)C(=O)N[C@@H](CCC(O)=O)C(O)=O