Reaction Details
TargetFolate receptor alpha
LigandBDBM50027654
Substrate/Competitorn/a
Meas. Tech.ChEMBL_1431345 (CHEMBL3387471)
IC50 9.5±n/a nM
Citation Golani, LKGeorge, CZhao, SRaghavan, SOrr, SWallace, AWilson, MRHou, ZMatherly, LHGangjee, A Structure-activity profiles of novel 6-substituted pyrrolo[2,3-d]pyrimidine thienoyl antifolates with modified amino acids for cellular uptake by folate receptorsa andß and the proton-coupled folate transporter. J Med Chem57:8152-66 (2014) 
 
Folate receptor alpha
Name:Folate receptor alpha
Type:PROTEIN
Mol. Mass.:29827.41
Organism:Homo sapiens (Human)
Description:ChEMBL_1469596
Residue:257
BDBM50027654
NameBDBM50027654
Synonyms:CHEMBL3335605
TypeSmall organic molecule
Emp. Form.C20H23N5O6S
Mol. Mass.461.492
SMILESNc1nc2[nH]c(CCCc3ccc(s3)C(=O)N[C@@H](CCCC(O)=O)C(O)=O)cc2c(=O)[nH]1