Reaction Details
TargetReduced folate transporter
LigandBDBM50354833
Substrate/Competitorn/a
Meas. Tech.ChEMBL_1431343 (CHEMBL3387469)
IC50 101±n/a nM
Citation Golani, LKGeorge, CZhao, SRaghavan, SOrr, SWallace, AWilson, MRHou, ZMatherly, LHGangjee, A Structure-activity profiles of novel 6-substituted pyrrolo[2,3-d]pyrimidine thienoyl antifolates with modified amino acids for cellular uptake by folate receptorsa andß and the proton-coupled folate transporter. J Med Chem57:8152-66 (2014) 
 
Reduced folate transporter
Name:Reduced folate transporter
Type:PROTEIN
Mol. Mass.:64885.16
Organism:Homo sapiens (Human)
Description:ChEMBL_1469594
Residue:591
BDBM50354833
NameBDBM50354833
Synonyms:AGF94 | CHEMBL1834488
TypeSmall organic molecule
Emp. Form.C19H21N5O6S
Mol. Mass.447.465
SMILESNc1nc2[nH]c(CCCc3ccc(s3)C(=O)N[C@@H](CCC(O)=O)C(O)=O)cc2c(=O)[nH]1