Reaction Details
Target25-hydroxyvitamin D-1 alpha hydroxylase, mitochondrial
LigandBDBM50027700
Substrate/Competitorn/a
Meas. Tech.ChEMBL_1435384 (CHEMBL3383458)
IC50 100±n/a nM
Citation Ferla, SGomaa, MSBrancale, AZhu, JOchalek, JTDeLuca, HFSimons, C Novel styryl-indoles as small molecule inhibitors of 25-hydroxyvitamin D-24-hydroxylase (CYP24A1): Synthesis and biological evaluation. Eur J Med Chem87:39-51 (2014) 
 
25-hydroxyvitamin D-1 alpha hydroxylase, mitochondrial
Name:25-hydroxyvitamin D-1 alpha hydroxylase, mitochondrial
Type:PROTEIN
Mol. Mass.:56238.51
Organism:Mus musculus
Description:ChEMBL_109473
Residue:507
BDBM50027700
NameBDBM50027700
Synonyms:CHEMBL3344395
TypeSmall organic molecule
Emp. Form.C25H27N3O2
Mol. Mass.401.5008
SMILESCOc1cc(OC)cc(\C=C\c2cccc3n(CCCCn4ccnc4)ccc23)c1