Reaction Details
Target25-hydroxyvitamin D-1 alpha hydroxylase, mitochondrial
LigandBDBM50027694
Substrate/Competitorn/a
Meas. Tech.ChEMBL_1435384 (CHEMBL3383458)
IC50 150±n/a nM
Citation Ferla, SGomaa, MSBrancale, AZhu, JOchalek, JTDeLuca, HFSimons, C Novel styryl-indoles as small molecule inhibitors of 25-hydroxyvitamin D-24-hydroxylase (CYP24A1): Synthesis and biological evaluation. Eur J Med Chem87:39-51 (2014) 
 
25-hydroxyvitamin D-1 alpha hydroxylase, mitochondrial
Name:25-hydroxyvitamin D-1 alpha hydroxylase, mitochondrial
Type:PROTEIN
Mol. Mass.:56238.51
Organism:Mus musculus
Description:ChEMBL_109473
Residue:507
BDBM50027694
NameBDBM50027694
Synonyms:CHEMBL3344397
TypeSmall organic molecule
Emp. Form.C23H23N3
Mol. Mass.341.4488
SMILESC(CCn1ccc2cc(\C=C\c3ccccc3)ccc12)Cn1ccnc1