Reaction Details
TargetHistone deacetylase 6
LigandBDBM19149
Substrate/Competitorn/a
Meas. Tech.ChEMBL_1435429 (CHEMBL3384071)
IC50 2310±n/a nM
Citation Sodji, QPatil, VJain, SKornacki, JRMrksich, MTekwani, BLOyelere, AK The antileishmanial activity of isoforms 6- and 8-selective histone deacetylase inhibitors. Bioorg Med Chem Lett24:4826-30 (2014) 
 
Histone deacetylase 6
Name:Histone deacetylase 6
Type:Chromatin regulator; hydrolase; repressor
Mol. Mass.:131381.51
Organism:Homo sapiens (Human)
Description:Q9UBN7
Residue:1215
BDBM19149
NameBDBM19149
Synonyms:CHEMBL98 SAHA US10188756, Compound SAHA US11505523, Compound SAHA US9353061, SAHA US9695181, Vorinostat Zolinza suberoylanilide hydroxamic acid
TypeSmall organic molecule
Emp. Form.C14H20N2O3
Mol. Mass.264.3202
SMILESONC(=O)CCCCCCC(=O)Nc1ccccc1