Reaction Details
TargetApelin receptor
LigandBDBM50027850
Substrate/Competitorn/a
Meas. Tech.ChEMBL_1436814 (CHEMBL3386599)
EC50>30000±n/a nM
Citation McKeown, SCZecri, FJFortier, ETaggart, ASviridenko, LAdams, CMMcAllister, KHPin, SS The design and implementation of a generic lipopeptide scanning platform to enable the identification of 'locally acting' agonists for the apelin receptor. Bioorg Med Chem Lett24:4871-5 (2014) 
 
Apelin receptor
Name:Apelin receptor
Type:Enzyme Catalytic Domain
Mol. Mass.:42664.06
Organism:Homo sapiens (Human)
Description:P35414
Residue:380
BDBM50027850
NameBDBM50027850
Synonyms:CHEMBL3338679
TypeSmall organic molecule
Emp. Form.C74H109N17O18
Mol. Mass.1524.7604
SMILESCC(C)C[C@H](NC(=O)[C@@H]1CCCN1C(=O)[C@H](CC(C)C)NC(=O)[C@@H](NC(=O)[C@@H](NC(C)=O)C(C)C)[C@@H](C)O)C(=O)N[C@@H](Cc1c[nH]c2ccccc12)C(=O)N[C@@H](C)C(=O)N[C@@H]([C@@H](C)O)C(=O)N[C@@H](Cc1ccc(O)cc1)C(=O)N[C@@H]([C@@H](C)O)C(=O)N[C@@H](Cc1ccc(O)cc1)C(=O)N[C@@H](CCCNC(N)=N)C(N)=O