Reaction Details
TargetKappa-type opioid receptor
LigandBDBM50028061
Substrate/Competitorn/a
Meas. Tech.ChEMBL_1434016 (CHEMBL3381488)
Ki>1000±n/a nM
Citation Hirayama, SWada, NKuroda, NIwai, TYamaotsu, NHirono, SFujii, HNagase, H Synthesis of a novel universal opioid receptor agonist with the 1,3,5-trioxazatriquinane skeleton and its pharmacologies. Bioorg Med Chem Lett24:4895-8 (2014) 
 
Kappa-type opioid receptor
Name:Kappa-type opioid receptor
Type:G Protein-Coupled Receptor (GPCR)
Mol. Mass.:42744.99
Organism:Cavia porcellus (domestic guinea pig)
Description:P41144
Residue:380
BDBM50028061
NameBDBM50028061
Synonyms:CHEMBL3338873
TypeSmall organic molecule
Emp. Form.C20H21NO5
Mol. Mass.355.3844
SMILES[H][C@]12CO[C@]3([H])N1[C@@]([H])(O[C@@]3(C)c1ccccc1O)[C@@](C)(O2)c1ccccc1O