Reaction Details
TargetMu-type opioid receptor
LigandBDBM50028060
Substrate/Competitorn/a
Meas. Tech.ChEMBL_1434014 (CHEMBL3381486)
Ki>1000±n/a nM
Citation Hirayama, SWada, NKuroda, NIwai, TYamaotsu, NHirono, SFujii, HNagase, H Synthesis of a novel universal opioid receptor agonist with the 1,3,5-trioxazatriquinane skeleton and its pharmacologies. Bioorg Med Chem Lett24:4895-8 (2014) 
 
Mu-type opioid receptor
Name:Mu-type opioid receptor
Type:Enzyme Catalytic Domain
Mol. Mass.:44431.62
Organism:MOUSE
Description:OPIATE Mu OPRM1 MOUSE::P42866
Residue:398
BDBM50028060
NameBDBM50028060
Synonyms:CHEMBL3338872
TypeSmall organic molecule
Emp. Form.C27H27NO6
Mol. Mass.461.5064
SMILES[H][C@]12O[C@](C)(c3ccc(O)cc3)[C@]3([H])O[C@@](C)(c4ccc(O)cc4)[C@]([H])(O[C@]1(C)c1ccc(O)cc1)N23