Reaction Details
TargetMu-type opioid receptor
LigandBDBM50028077
Substrate/Competitorn/a
Meas. Tech.ChEMBL_1434014 (CHEMBL3381486)
Ki>1000±n/a nM
Citation Hirayama, SWada, NKuroda, NIwai, TYamaotsu, NHirono, SFujii, HNagase, H Synthesis of a novel universal opioid receptor agonist with the 1,3,5-trioxazatriquinane skeleton and its pharmacologies. Bioorg Med Chem Lett24:4895-8 (2014) 
 
Mu-type opioid receptor
Name:Mu-type opioid receptor
Type:Enzyme Catalytic Domain
Mol. Mass.:44431.62
Organism:MOUSE
Description:OPIATE Mu OPRM1 MOUSE::P42866
Residue:398
BDBM50028077
NameBDBM50028077
Synonyms:CHEMBL3338881
TypeSmall organic molecule
Emp. Form.C13H15NO4
Mol. Mass.249.2625
SMILES[H][C@]12CO[C@]3([H])N1[C@]([H])(CO2)O[C@@]3(C)c1ccccc1O