Reaction Details
TargetC-X-C chemokine receptor type 2
LigandBDBM150973
Substrate/Competitorn/a
Meas. Tech.ChEMBL_1436204 (CHEMBL3386566)
IC50 105±n/a nM
Citation Maeda, DYPeck, AMSchuler, ADQuinn, MTKirpotina, LNWicomb, WNFan, GHZebala, JA Discovery of 2-[5-(4-Fluorophenylcarbamoyl)pyridin-2-ylsulfanylmethyl]phenylboronic Acid (SX-517): Noncompetitive Boronic Acid Antagonist of CXCR1 and CXCR2. J Med Chem57:8378-97 (2014) 
 
C-X-C chemokine receptor type 2
Name:C-X-C chemokine receptor type 2
Type:Protein
Mol. Mass.:40767.88
Organism:Homo sapiens (Human)
Description:P25025
Residue:360
BDBM150973
NameBDBM150973
Synonyms:US8981106, 163
TypeSmall organic molecule
Emp. Form.C19H17BN2O4S
Mol. Mass.380.225
SMILESOB(O)c1ccccc1CSc1ccc(cn1)C(=O)Nc1ccc(O)cc1