Reaction Details
TargetC-X-C chemokine receptor type 2
LigandBDBM150822
Substrate/Competitorn/a
Meas. Tech.ChEMBL_1436204 (CHEMBL3386566)
IC50 277±n/a nM
Citation Maeda, DYPeck, AMSchuler, ADQuinn, MTKirpotina, LNWicomb, WNFan, GHZebala, JA Discovery of 2-[5-(4-Fluorophenylcarbamoyl)pyridin-2-ylsulfanylmethyl]phenylboronic Acid (SX-517): Noncompetitive Boronic Acid Antagonist of CXCR1 and CXCR2. J Med Chem57:8378-97 (2014) 
 
C-X-C chemokine receptor type 2
Name:C-X-C chemokine receptor type 2
Type:Protein
Mol. Mass.:40767.88
Organism:Homo sapiens (Human)
Description:P25025
Residue:360
BDBM150822
NameBDBM150822
Synonyms:US8981106, 13 (SX-578) | USRE47267, Compound 13
TypeSmall organic molecule
Emp. Form.C19H15FN2O2S
Mol. Mass.354.398
SMILESOc1ccccc1CSc1ccc(cn1)C(=O)Nc1ccc(F)cc1