Reaction Details
TargetC-X-C chemokine receptor type 2
LigandBDBM150849
Substrate/Competitorn/a
Meas. Tech.ChEMBL_1436204 (CHEMBL3386566)
IC50>10000±n/a nM
Citation Maeda, DYPeck, AMSchuler, ADQuinn, MTKirpotina, LNWicomb, WNFan, GHZebala, JA Discovery of 2-[5-(4-Fluorophenylcarbamoyl)pyridin-2-ylsulfanylmethyl]phenylboronic Acid (SX-517): Noncompetitive Boronic Acid Antagonist of CXCR1 and CXCR2. J Med Chem57:8378-97 (2014) 
 
C-X-C chemokine receptor type 2
Name:C-X-C chemokine receptor type 2
Type:Protein
Mol. Mass.:40767.88
Organism:Homo sapiens (Human)
Description:P25025
Residue:360
BDBM150849
NameBDBM150849
Synonyms:US8981106, 38
TypeSmall organic molecule
Emp. Form.C23H18FN3OS
Mol. Mass.403.472
SMILESFc1ccc(NC(=O)c2ccc(SCc3cccc(c3)-n3cccc3)nc2)cc1