Reaction Details
TargetC-X-C chemokine receptor type 2
LigandBDBM150852
Substrate/Competitorn/a
Meas. Tech.ChEMBL_1436204 (CHEMBL3386566)
IC50>10000±n/a nM
Citation Maeda, DYPeck, AMSchuler, ADQuinn, MTKirpotina, LNWicomb, WNFan, GHZebala, JA Discovery of 2-[5-(4-Fluorophenylcarbamoyl)pyridin-2-ylsulfanylmethyl]phenylboronic Acid (SX-517): Noncompetitive Boronic Acid Antagonist of CXCR1 and CXCR2. J Med Chem57:8378-97 (2014) 
 
C-X-C chemokine receptor type 2
Name:C-X-C chemokine receptor type 2
Type:Protein
Mol. Mass.:40767.88
Organism:Homo sapiens (Human)
Description:P25025
Residue:360
BDBM150852
NameBDBM150852
Synonyms:US8981106, 41
TypeSmall organic molecule
Emp. Form.C20H14F4N2O2S
Mol. Mass.422.396
SMILESFc1ccc(NC(=O)c2ccc(SCc3ccc(OC(F)(F)F)cc3)nc2)cc1