Reaction Details
TargetC-X-C chemokine receptor type 2
LigandBDBM150887
Substrate/Competitorn/a
Meas. Tech.ChEMBL_1436204 (CHEMBL3386566)
IC50 540±n/a nM
Citation Maeda, DYPeck, AMSchuler, ADQuinn, MTKirpotina, LNWicomb, WNFan, GHZebala, JA Discovery of 2-[5-(4-Fluorophenylcarbamoyl)pyridin-2-ylsulfanylmethyl]phenylboronic Acid (SX-517): Noncompetitive Boronic Acid Antagonist of CXCR1 and CXCR2. J Med Chem57:8378-97 (2014) 
 
C-X-C chemokine receptor type 2
Name:C-X-C chemokine receptor type 2
Type:Protein
Mol. Mass.:40767.88
Organism:Homo sapiens (Human)
Description:P25025
Residue:360
BDBM150887
NameBDBM150887
Synonyms:US8981106, 76
TypeSmall organic molecule
Emp. Form.C17H17FN2O2S
Mol. Mass.332.392
SMILESFc1ccc(NC(=O)c2ccc(SCC3CCCO3)nc2)cc1