Reaction Details
TargetC-X-C chemokine receptor type 2
LigandBDBM150885
Substrate/Competitorn/a
Meas. Tech.ChEMBL_1436204 (CHEMBL3386566)
IC50>5000±n/a nM
Citation Maeda, DYPeck, AMSchuler, ADQuinn, MTKirpotina, LNWicomb, WNFan, GHZebala, JA Discovery of 2-[5-(4-Fluorophenylcarbamoyl)pyridin-2-ylsulfanylmethyl]phenylboronic Acid (SX-517): Noncompetitive Boronic Acid Antagonist of CXCR1 and CXCR2. J Med Chem57:8378-97 (2014) 
 
C-X-C chemokine receptor type 2
Name:C-X-C chemokine receptor type 2
Type:Protein
Mol. Mass.:40767.88
Organism:Homo sapiens (Human)
Description:P25025
Residue:360
BDBM150885
NameBDBM150885
Synonyms:US8981106, 74
TypeSmall organic molecule
Emp. Form.C18H12F4N2O2S
Mol. Mass.396.359
SMILESFc1ccc(NC(=O)c2ccc(SCc3ccc(o3)C(F)(F)F)nc2)cc1