Reaction Details
TargetC-X-C chemokine receptor type 2
LigandBDBM150889
Substrate/Competitorn/a
Meas. Tech.ChEMBL_1436204 (CHEMBL3386566)
IC50>5000±n/a nM
Citation Maeda, DYPeck, AMSchuler, ADQuinn, MTKirpotina, LNWicomb, WNFan, GHZebala, JA Discovery of 2-[5-(4-Fluorophenylcarbamoyl)pyridin-2-ylsulfanylmethyl]phenylboronic Acid (SX-517): Noncompetitive Boronic Acid Antagonist of CXCR1 and CXCR2. J Med Chem57:8378-97 (2014) 
 
C-X-C chemokine receptor type 2
Name:C-X-C chemokine receptor type 2
Type:Protein
Mol. Mass.:40767.88
Organism:Homo sapiens (Human)
Description:P25025
Residue:360
BDBM150889
NameBDBM150889
Synonyms:US8981106, 78
TypeSmall organic molecule
Emp. Form.C18H19FN2O2S
Mol. Mass.346.419
SMILESFc1ccc(NC(=O)c2ccc(SCC3CCCCO3)nc2)cc1