Reaction Details
TargetC-X-C chemokine receptor type 2
LigandBDBM150811
Substrate/Competitorn/a
Meas. Tech.ChEMBL_1436205 (CHEMBL3386567)
IC50 60±n/a nM
Citation Maeda, DYPeck, AMSchuler, ADQuinn, MTKirpotina, LNWicomb, WNFan, GHZebala, JA Discovery of 2-[5-(4-Fluorophenylcarbamoyl)pyridin-2-ylsulfanylmethyl]phenylboronic Acid (SX-517): Noncompetitive Boronic Acid Antagonist of CXCR1 and CXCR2. J Med Chem57:8378-97 (2014) 
 
C-X-C chemokine receptor type 2
Name:C-X-C chemokine receptor type 2
Type:Protein
Mol. Mass.:40767.88
Organism:Homo sapiens (Human)
Description:P25025
Residue:360
BDBM150811
NameBDBM150811
Synonyms:US8981106, 1 (SX-517) | USRE47267, Compound 1
TypeSmall organic molecule
Emp. Form.C19H16BFN2O3S
Mol. Mass.382.216
SMILESOB(O)c1ccccc1CSc1ccc(cn1)C(=O)Nc1ccc(F)cc1