Reaction Details
TargetCarbonic anhydrase 9
LigandBDBM50028530
Substrate/Competitorn/a
Meas. Tech.ChEMBL_1438348 (CHEMBL3382411)
Ki 90±n/a nM
Citation Ghorab, MMCeruso, MAlsaid, MSNissan, YMArafa, RKSupuran, CT Novel sulfonamides bearing pyrrole and pyrrolopyrimidine moieties as carbonic anhydrase inhibitors: Synthesis, cytotoxic activity and molecular modeling. Eur J Med Chem87:186-96 (2014) 
 
Carbonic anhydrase 9
Name:Carbonic anhydrase 9
Type:Enzyme
Mol. Mass.:49669.03
Organism:Homo sapiens (Human)
Description:Catalytic domain of human cloned isozyme was used in the assay
Residue:459
BDBM50028530
NameBDBM50028530
Synonyms:CHEMBL3342488
TypeSmall organic molecule
Emp. Form.C24H17BrClN5O2S2
Mol. Mass.586.911
SMILESNS(=O)(=O)c1ccc(cc1)-n1cc(c(C#N)c1NC(=S)Nc1ccc(Cl)cc1)-c1ccc(Br)cc1