Reaction Details
TargetCarbonic anhydrase 9
LigandBDBM50028562
Substrate/Competitorn/a
Meas. Tech.ChEMBL_1438348 (CHEMBL3382411)
Ki 5.5±n/a nM
Citation Ghorab, MMCeruso, MAlsaid, MSNissan, YMArafa, RKSupuran, CT Novel sulfonamides bearing pyrrole and pyrrolopyrimidine moieties as carbonic anhydrase inhibitors: Synthesis, cytotoxic activity and molecular modeling. Eur J Med Chem87:186-96 (2014) 
 
Carbonic anhydrase 9
Name:Carbonic anhydrase 9
Type:Enzyme
Mol. Mass.:49669.03
Organism:Homo sapiens (Human)
Description:Catalytic domain of human cloned isozyme was used in the assay
Residue:459
BDBM50028562
NameBDBM50028562
Synonyms:CHEMBL3342501
TypeSmall organic molecule
Emp. Form.C21H17BrN4O4S
Mol. Mass.501.353
SMILESCC(=O)CC(=O)Nc1c(C#N)c(cn1-c1ccc(cc1)S(N)(=O)=O)-c1ccc(Br)cc1