Reaction Details
TargetCarbonic anhydrase 9
LigandBDBM50028565
Substrate/Competitorn/a
Meas. Tech.ChEMBL_1438348 (CHEMBL3382411)
Ki 488±n/a nM
Citation Ghorab, MMCeruso, MAlsaid, MSNissan, YMArafa, RKSupuran, CT Novel sulfonamides bearing pyrrole and pyrrolopyrimidine moieties as carbonic anhydrase inhibitors: Synthesis, cytotoxic activity and molecular modeling. Eur J Med Chem87:186-96 (2014) 
 
Carbonic anhydrase 9
Name:Carbonic anhydrase 9
Type:Enzyme
Mol. Mass.:49669.03
Organism:Homo sapiens (Human)
Description:Catalytic domain of human cloned isozyme was used in the assay
Residue:459
BDBM50028565
NameBDBM50028565
Synonyms:CHEMBL3342504
TypeSmall organic molecule
Emp. Form.C31H19BrCl2N4O4S
Mol. Mass.694.382
SMILESNS(=O)(=O)c1ccc(cc1)-n1cc(-c2ccc(Br)cc2)c2c1nc(-c1ccc(Cl)cc1)n(C(=O)c1ccc(Cl)cc1)c2=O