Reaction Details
TargetCarbonic anhydrase 2
LigandBDBM50028558
Substrate/Competitorn/a
Meas. Tech.ChEMBL_1438347 (CHEMBL3382410)
Ki 89±n/a nM
Citation Ghorab, MMCeruso, MAlsaid, MSNissan, YMArafa, RKSupuran, CT Novel sulfonamides bearing pyrrole and pyrrolopyrimidine moieties as carbonic anhydrase inhibitors: Synthesis, cytotoxic activity and molecular modeling. Eur J Med Chem87:186-96 (2014) 
 
Carbonic anhydrase 2
Name:Carbonic anhydrase 2
Type:Enzyme
Mol. Mass.:29250.71
Organism:Homo sapiens (Human)
Description:P00918
Residue:260
BDBM50028558
NameBDBM50028558
Synonyms:CHEMBL3342497
TypeSmall organic molecule
Emp. Form.C18H14BrN5O2S2
Mol. Mass.476.37
SMILESNc1nc(=S)[nH]c2n(cc(-c3ccc(Br)cc3)c12)-c1ccc(cc1)S(N)(=O)=O