Reaction Details
TargetCarbonic anhydrase 12
LigandBDBM50028563
Substrate/Competitorn/a
Meas. Tech.ChEMBL_1438349 (CHEMBL3382412)
Ki 9.5±n/a nM
Citation Ghorab, MMCeruso, MAlsaid, MSNissan, YMArafa, RKSupuran, CT Novel sulfonamides bearing pyrrole and pyrrolopyrimidine moieties as carbonic anhydrase inhibitors: Synthesis, cytotoxic activity and molecular modeling. Eur J Med Chem87:186-96 (2014) 
 
Carbonic anhydrase 12
Name:Carbonic anhydrase 12
Type:Enzyme
Mol. Mass.:39456.00
Organism:Homo sapiens (Human)
Description:Catalytic domain of human cloned isozyme was used in the assay
Residue:354
BDBM50028563
NameBDBM50028563
Synonyms:CHEMBL3342502
TypeSmall organic molecule
Emp. Form.C24H16Br2N4O3S
Mol. Mass.600.282
SMILESNS(=O)(=O)c1ccc(cc1)-n1cc(c(C#N)c1NC(=O)c1ccc(Br)cc1)-c1ccc(Br)cc1