Reaction Details
TargetCarbonic anhydrase 2
LigandBDBM50028553
Substrate/Competitorn/a
Meas. Tech.ChEMBL_1438347 (CHEMBL3382410)
Ki 8.5±n/a nM
Citation Ghorab, MMCeruso, MAlsaid, MSNissan, YMArafa, RKSupuran, CT Novel sulfonamides bearing pyrrole and pyrrolopyrimidine moieties as carbonic anhydrase inhibitors: Synthesis, cytotoxic activity and molecular modeling. Eur J Med Chem87:186-96 (2014) 
 
Carbonic anhydrase 2
Name:Carbonic anhydrase 2
Type:Enzyme
Mol. Mass.:29250.71
Organism:Homo sapiens (Human)
Description:P00918
Residue:260
BDBM50028553
NameBDBM50028553
Synonyms:CHEMBL3342492
TypeSmall organic molecule
Emp. Form.C24H19BrN6O4S3
Mol. Mass.631.544
SMILESNS(=O)(=O)c1ccc(NC(=S)Nc2c(C#N)c(cn2-c2ccc(cc2)S(N)(=O)=O)-c2ccc(Br)cc2)cc1