Reaction Details
TargetCarbonic anhydrase 1
LigandBDBM50028552
Substrate/Competitorn/a
Meas. Tech.ChEMBL_1438346 (CHEMBL3382409)
Ki 887±n/a nM
Citation Ghorab, MMCeruso, MAlsaid, MSNissan, YMArafa, RKSupuran, CT Novel sulfonamides bearing pyrrole and pyrrolopyrimidine moieties as carbonic anhydrase inhibitors: Synthesis, cytotoxic activity and molecular modeling. Eur J Med Chem87:186-96 (2014) 
 
Carbonic anhydrase 1
Name:Carbonic anhydrase 1
Type:Enzyme
Mol. Mass.:28873.37
Organism:Homo sapiens (Human)
Description:P00915
Residue:261
BDBM50028552
NameBDBM50028552
Synonyms:CHEMBL3342491
TypeSmall organic molecule
Emp. Form.C24H17BrIN5O2S2
Mol. Mass.678.363
SMILESNS(=O)(=O)c1ccc(cc1)-n1cc(c(C#N)c1NC(=S)Nc1ccc(I)cc1)-c1ccc(Br)cc1