Reaction Details
TargetCarbonic anhydrase 1
LigandBDBM50028566
Substrate/Competitorn/a
Meas. Tech.ChEMBL_1438346 (CHEMBL3382409)
Ki 198±n/a nM
Citation Ghorab, MMCeruso, MAlsaid, MSNissan, YMArafa, RKSupuran, CT Novel sulfonamides bearing pyrrole and pyrrolopyrimidine moieties as carbonic anhydrase inhibitors: Synthesis, cytotoxic activity and molecular modeling. Eur J Med Chem87:186-96 (2014) 
 
Carbonic anhydrase 1
Name:Carbonic anhydrase 1
Type:Enzyme
Mol. Mass.:28873.37
Organism:Homo sapiens (Human)
Description:P00915
Residue:261
BDBM50028566
NameBDBM50028566
Synonyms:CHEMBL3342486
TypeSmall organic molecule
Emp. Form.C24H18BrN5O2S2
Mol. Mass.552.466
SMILESNS(=O)(=O)c1ccc(cc1)-n1cc(c(C#N)c1NC(=S)Nc1ccccc1)-c1ccc(Br)cc1