Reaction Details
TargetC3a anaphylatoxin chemotactic receptor
LigandBDBM50028695
Substrate/Competitorn/a
Meas. Tech.ChEMBL_1439874 (CHEMBL3387989)
EC50 126±n/a nM
Citation Reid, RCYau, MKSingh, RHamidon, JKLim, JStoermer, MJFairlie, DP Potent heterocyclic ligands for human complement c3a receptor. J Med Chem57:8459-70 (2014) 
 
C3a anaphylatoxin chemotactic receptor
Name:C3a anaphylatoxin chemotactic receptor
Type:PROTEIN
Mol. Mass.:53864.66
Organism:Homo sapiens (Human)
Description:ChEMBL_642034
Residue:482
BDBM50028695
NameBDBM50028695
Synonyms:CHEMBL3342688
TypeSmall organic molecule
Emp. Form.C23H26N6O3
Mol. Mass.434.4909
SMILESNC(=N)NCCC[C@H](NC(=O)c1c[nH]c(n1)C(c1ccccc1)c1ccccc1)C(O)=O