Reaction Details
TargetC3a anaphylatoxin chemotactic receptor
LigandBDBM50028702
Substrate/Competitorn/a
Meas. Tech.ChEMBL_1439872 (CHEMBL3387987)
IC50 12±n/a nM
Citation Reid, RCYau, MKSingh, RHamidon, JKLim, JStoermer, MJFairlie, DP Potent heterocyclic ligands for human complement c3a receptor. J Med Chem57:8459-70 (2014) 
 
C3a anaphylatoxin chemotactic receptor
Name:C3a anaphylatoxin chemotactic receptor
Type:PROTEIN
Mol. Mass.:53864.66
Organism:Homo sapiens (Human)
Description:ChEMBL_642034
Residue:482
BDBM50028702
NameBDBM50028702
Synonyms:CHEMBL3342680
TypeSmall organic molecule
Emp. Form.C22H24N6O4
Mol. Mass.436.4638
SMILESNC(=N)NCCC[C@H](NC(=O)c1nc(no1)C(c1ccccc1)c1ccccc1)C(O)=O