Reaction Details
TargetProstaglandin E synthase
LigandBDBM50099408
Substrate/Competitorn/a
Meas. Tech.ChEMBL_1440656 (CHEMBL3390408)
IC50 10.0±n/a nM
Citation Banerjee, APawar, MYPatil, SYadav, PSKadam, PAKattige, VGDeshpande, DSPednekar, PVPisat, MKGharat, LA Development of 2-aryl substituted quinazolin-4(3H)-one, pyrido[4,3-d]pyrimidin-4(3H)-one and pyrido[2,3-d]pyrimidin-4(3H)-one derivatives as microsomal prostaglandin E(2) synthase-1 inhibitors. Bioorg Med Chem Lett24:4838-44 (2014) 
 
Prostaglandin E synthase
Name:Prostaglandin E synthase
Type:Protein
Mol. Mass.:17112.22
Organism:Homo sapiens (Human)
Description:n/a
Residue:152
BDBM50099408
NameBDBM50099408
Synonyms:CHEMBL3356955
TypeSmall organic molecule
Emp. Form.C21H16N2O5S2
Mol. Mass.440.492
SMILESNS(=O)(=O)c1ccccc1S(=O)(=O)NC(=O)c1ccc(cc1)C#Cc1ccccc1