Reaction Details
TargetProstaglandin E synthase
LigandBDBM50099413
Substrate/Competitorn/a
Meas. Tech.ChEMBL_1439894 (CHEMBL3388594)
IC50 59±n/a nM
Citation Banerjee, APawar, MYPatil, SYadav, PSKadam, PAKattige, VGDeshpande, DSPednekar, PVPisat, MKGharat, LA Development of 2-aryl substituted quinazolin-4(3H)-one, pyrido[4,3-d]pyrimidin-4(3H)-one and pyrido[2,3-d]pyrimidin-4(3H)-one derivatives as microsomal prostaglandin E(2) synthase-1 inhibitors. Bioorg Med Chem Lett24:4838-44 (2014) 
 
Prostaglandin E synthase
Name:Prostaglandin E synthase
Type:Protein
Mol. Mass.:17112.22
Organism:Homo sapiens (Human)
Description:n/a
Residue:152
BDBM50099413
NameBDBM50099413
Synonyms:CHEMBL3342846
TypeSmall organic molecule
Emp. Form.C27H31Cl2N5O3
Mol. Mass.544.473
SMILESCC(C)C(=O)NCc1ccc(Cl)c(c1)-c1nc2cc(Cl)c(cc2c(=O)[nH]1)N1CC(C1)C(=O)NC(C)(C)C