Reaction Details
TargetProstaglandin E synthase
LigandBDBM50028869
Substrate/Competitorn/a
Meas. Tech.ChEMBL_1439894 (CHEMBL3388594)
IC50 63±n/a nM
Citation Banerjee, APawar, MYPatil, SYadav, PSKadam, PAKattige, VGDeshpande, DSPednekar, PVPisat, MKGharat, LA Development of 2-aryl substituted quinazolin-4(3H)-one, pyrido[4,3-d]pyrimidin-4(3H)-one and pyrido[2,3-d]pyrimidin-4(3H)-one derivatives as microsomal prostaglandin E(2) synthase-1 inhibitors. Bioorg Med Chem Lett24:4838-44 (2014) 
 
Prostaglandin E synthase
Name:Prostaglandin E synthase
Type:Protein
Mol. Mass.:17112.22
Organism:Homo sapiens (Human)
Description:n/a
Residue:152
BDBM50028869
NameBDBM50028869
Synonyms:CHEMBL3342707
TypeSmall organic molecule
Emp. Form.C19H17ClN4O4
Mol. Mass.400.816
SMILESCC(C)C(=O)NCc1ccc(Cl)c(c1)-c1nc2cc(ccc2c(=O)[nH]1)[N+]([O-])=O